{"text_format":"1","workbook":"xlsx","n_sheets":2,"sheets":["Beregner","Bilag"],"not_rendered":{"charts":0,"images":0,"macros":1,"external_links":0,"defined_names":0,"comments":0,"pivot_tables":0},"unopened":[],"bounds":{"document_bytes":16777216,"sheet_cells":100000,"rows_first":2000,"rows_last":500,"rows_between":2000,"halvings":0,"cell_chars":16384,"cell_head_chars":4096},"cells_cut":0,"cells_raw":0,"read":"whole","date_system":"1900"}

{"sheet":"Beregner","index":0,"n_rows":26,"n_cols":8,"rows_kept":26,"cut":false,"hidden":false,"merged":[]}
[]
[]
[null,"Indtastning",null,null,null,null,null,"Sådan gør du"]
[null,"Forventet årlig forbrug (m3):",0,null,"Forbruget skal være mellem 0 og 20.000 m3",null,null,"Indtast dit postnummer."]
[null,"Postnummer ",6000,null,"Er Postnummeret indtastet?",null,null,"Indtast dit forventede årsforbrug. "]
[null,"Evida Distributionsselskab",{"$f":"+_xlfn.XLOOKUP(C5,Bilag!B:B,Bilag!C:C,\"Ikke fundet\")","v":"Evida Syd"},null,null,null,null,"Du finder det forventede årsforbrug på din seneste regning fra Evida."]
[null,null,null,null,null,null,null,"Vær opmærksom på, at dit forventede årsforbrug bliver beregnet på ny hvert kvartal,"]
[null,"Årlig forventet tarifbetaling:","Ekskl. moms\t",null,"Inkl. moms",null,null,"når du har afleveret en aflæsning til Evida. Dit forventede årsforbrug kan altså ændre "]
[null,{"$f":"+_xlfn.XLOOKUP(Beregner!$C$6,Bilag!$B:$B,Bilag!$K:$K,\"Administrationsbidrag:\")","v":"Abonnement:"},{"$f":"+IFERROR(_xlfn.XLOOKUP(C6,Bilag!B:B,Bilag!D:D,)*Bilag!D4, )","v":300},null,{"$f":"+C9*1.25","v":375},null,null,"sig i løbet af året."]
[null,"Distributionstarif:",{"$f":"+IFERROR(C4*_xlfn.XLOOKUP(C6,Bilag!B:B,Bilag!C:C)*Bilag!D4, )","v":0},null,{"$f":"+C10*1.25","v":0}]
[null,"Nødforsyningstarif:",{"$f":"+IFERROR(C4*_xlfn.XLOOKUP(Beregner!C6,Bilag!B:B,Bilag!H:H)*Bilag!D4,0)","v":0},null,{"$f":"+C11*1.25","v":0}]
[]
[null,"Årlig forventet afgifter:",null,null,null,null,null,"Vigtigt at vide"]
[null,"Naturgasafgift",{"$f":"+IFERROR(C4*_xlfn.XLOOKUP(Beregner!C6,Bilag!B:B,Bilag!E:E)*Bilag!D4,0)","v":0},null,{"$f":"+C14*1.25","v":0},null,null,"Beregningen er KUN vejledende. "]
[null,"CO2-afgift",{"$f":"+IFERROR(C4*_xlfn.XLOOKUP(Beregner!C6,Bilag!B:B,Bilag!F:F)*Bilag!D4,0)","v":0},null,{"$f":"+C15*1.25","v":0},null,null,"Priserne er gældende pr. 1. januar 2024, og dermed er beregningen kun gældende, "]
[null,"NOx-afgift",{"$f":"+IFERROR(C4*_xlfn.XLOOKUP(Beregner!C6,Bilag!B:B,Bilag!G:G)*Bilag!D4,0)","v":0},null,0,null,null,"indtil priserne evt. ændrer sig."]
[null,null,null,null,null,null,null,"Beregneren kan kun benyttes af privatkunder. "]
[null,"I alt:",{"$f":"+SUM(C9:C16)*Bilag!D4","v":300},null,{"$f":"+SUM(E9:E16)","v":375},null,null,"Er du erhvervskunde, kan du altså ikke benytte beregneren."]
[]
[null,"Regning fordelt over året (aconto afregnet):","Ekskl. moms\t",null,"Inkl. moms"]
[null,"Aconto januar-marts",{"$f":"+SUM($C$14:$C$16,$C$10,$C$11)*Bilag!C7*Bilag!$D$4+$C$9/4","v":75},null,{"$f":"+C21*1.25","v":93.75}]
[null,"Aconto april-juni",{"$f":"+SUM($C$14:$C$16,$C$10,$C$11)*Bilag!C8*Bilag!$D$4+$C$9/4","v":75},null,{"$f":"+C22*1.25","v":93.75}]
[null,"Aconto juli-september",{"$f":"+SUM($C$14:$C$16,$C$10,$C$11)*Bilag!C9*Bilag!$D$4+$C$9/4","v":75},null,{"$f":"+C23*1.25","v":93.75}]
[null,"Aconto oktober-december",{"$f":"+SUM($C$14:$C$16,$C$10,$C$11)*Bilag!C10*Bilag!$D$4+$C$9/4","v":75},null,{"$f":"+C24*1.25","v":93.75}]
[]
[null,"I alt:",{"$f":"+SUM(C21:C24)*Bilag!D4","v":300},null,{"$f":"+SUM(E21:E24)","v":375}]

{"sheet":"Bilag","index":1,"n_rows":464,"n_cols":19,"rows_kept":464,"cut":false,"hidden":true,"merged":[]}
[]
[null,"Forbrug i interval 0-20000","Fejl 0/1",{"$f":"+IF(AND(Beregner!C4>=0,Beregner!C4<=20000),1,0)*COUNT(Beregner!C4)","v":1}]
[null,"Distributionsselskab","Fejl 0/1",{"$f":"+_xlfn.XLOOKUP(Beregner!C6,Bilag!B13:B15,Bilag!A13:A15,0)","v":1},null,null,null,null,null,null,null,null,null,null,"Forbrugsmønster"]
[null,null,"Fejl 0/1",{"$f":"+IF(AND(Beregner!C4>=0,Beregner!C4<=20000),1,0)*_xlfn.XLOOKUP(Beregner!C6,Bilag!B13:B15,Bilag!A13:A15,0)","v":1},null,null,null,null,null,null,null,null,null,null,"Januar",523,null,"Total antal graddage",{"$f":"+SUM(P4:P15)","v":3450}]
[null,null,null,null,null,null,null,null,null,null,null,null,null,null,"Februar",483]
[null,"Fordeling af forbruget over året:",null,null,null,null,null,null,null,null,null,null,null,null,"Marts",460]
[null,"Aconto januar-marts",{"$f":"+SUM(P4:P6)/S4","v":0.42492753623188406},null,null,null,null,null,null,null,null,null,null,null,"April",316]
[null,"Aconto april-juni",{"$f":"+SUM(P7:P9)/S4","v":0.17652173913043478},null,null,null,null,null,null,null,null,null,null,null,"Maj",190]
[null,"Aconto juli-september",{"$f":"+SUM(P10:P12)/S4","v":7.8260869565217397E-2},null,null,null,null,null,null,null,null,null,null,null,"Juni",103]
[null,"Aconto oktober-december",{"$f":"+SUM(P13:P15)/S4","v":0.32028985507246377},null,null,null,null,null,null,null,null,null,null,null,"Juli",69]
[null,"Check",{"$f":"+SUM(C7:C10)=1","v":true},null,null,null,null,null,null,null,null,null,null,null,"August",69]
[null,null,"Volumentarif","Måler- og Administrationsgebyr","Naturgasafgift","CO2-afgift","NOx-afgift","Nødforsyningstarif til Energinet",null,null,"Navn til Beregner",null,null,null,"September",132]
[1,"Evida Nord",1.171,300,2.726,0.442,8.9999999999999993E-3,3.5860000000000003E-2,null,null,"Administrationsbidrag:",null,null,null,"Oktober",265]
[1,"Evida Syd",2.6230000000000002,300,2.726,0.442,8.9999999999999993E-3,3.5860000000000003E-2,null,null,"Abonnement:",null,null,null,"November",368]
[1,"Evida Fyn",2.3879999999999999,530.4,2.726,0.442,8.9999999999999993E-3,3.5860000000000003E-2,null,null,"Måler- og adm. gebyr:",null,null,null,"December",472]
[]
[null,"Postnummer","Evida Distributionsselskab"]
[null,2100,"Evida Syd"]
[null,2300,"Evida Syd"]
[null,2400,"Evida Syd"]
[null,2450,"Evida Syd"]
[null,2600,"Evida Nord"]
[null,2605,"Evida Nord"]
[null,2610,"Evida Nord"]
[null,2620,"Evida Nord"]
[null,2625,"Evida Nord"]
[null,2630,"Evida Nord"]
[null,2635,"Evida Nord"]
[null,2640,"Evida Nord"]
[null,2650,"Evida Nord"]
[null,2660,"Evida Nord"]
[null,2665,"Evida Nord"]
[null,2670,"Evida Nord"]
[null,2680,"Evida Nord"]
[null,2690,"Evida Nord"]
[null,2700,"Evida Nord"]
[null,2730,"Evida Nord"]
[null,2740,"Evida Nord"]
[null,2750,"Evida Nord"]
[null,2760,"Evida Nord"]
[null,2765,"Evida Nord"]
[null,2770,"Evida Nord"]
[null,2791,"Evida Nord"]
[null,2800,"Evida Nord"]
[null,2820,"Evida Nord"]
[null,2830,"Evida Nord"]
[null,2840,"Evida Nord"]
[null,2850,"Evida Nord"]
[null,2860,"Evida Nord"]
[null,2870,"Evida Nord"]
[null,2880,"Evida Nord"]
[null,2900,"Evida Nord"]
[null,2920,"Evida Nord"]
[null,2930,"Evida Nord"]
[null,2942,"Evida Nord"]
[null,2950,"Evida Nord"]
[null,2960,"Evida Nord"]
[null,2970,"Evida Nord"]
[null,2980,"Evida Nord"]
[null,2990,"Evida Nord"]
[null,3000,"Evida Nord"]
[null,3050,"Evida Nord"]
[null,3060,"Evida Nord"]
[null,3070,"Evida Nord"]
[null,3100,"Evida Nord"]
[null,3140,"Evida Nord"]
[null,3150,"Evida Nord"]
[null,3200,"Evida Nord"]
[null,3210,"Evida Nord"]
[null,3300,"Evida Nord"]
[null,3310,"Evida Nord"]
[null,3320,"Evida Nord"]
[null,3330,"Evida Nord"]
[null,3390,"Evida Nord"]
[null,3400,"Evida Nord"]
[null,3450,"Evida Nord"]
[null,3460,"Evida Nord"]
[null,3480,"Evida Nord"]
[null,3490,"Evida Nord"]
[null,3500,"Evida Nord"]
[null,3520,"Evida Nord"]
[null,3540,"Evida Nord"]
[null,3550,"Evida Nord"]
[null,3600,"Evida Nord"]
[null,3630,"Evida Nord"]
[null,3650,"Evida Nord"]
[null,3660,"Evida Nord"]
[null,3670,"Evida Nord"]
[null,4000,"Evida Nord"]
[null,4030,"Evida Nord"]
[null,4040,"Evida Nord"]
[null,4050,"Evida Nord"]
[null,4060,"Evida Nord"]
[null,4070,"Evida Nord"]
[null,4100,"Evida Syd"]
[null,4130,"Evida Nord"]
[null,4140,"Evida Nord"]
[null,4160,"Evida Syd"]
[null,4171,"Evida Syd"]
[null,4173,"Evida Syd"]
[null,4174,"Evida Syd"]
[null,4180,"Evida Syd"]
[null,4200,"Evida Syd"]
[null,4220,"Evida Syd"]
[null,4230,"Evida Syd"]
[null,4241,"Evida Syd"]
[null,4242,"Evida Syd"]
[null,4261,"Evida Syd"]
[null,4262,"Evida Syd"]
[null,4270,"Evida Syd"]
[null,4281,"Evida Syd"]
[null,4291,"Evida Syd"]
[null,4293,"Evida Syd"]
[null,4295,"Evida Syd"]
[null,4296,"Evida Syd"]
[null,4300,"Evida Syd"]
[null,4320,"Evida Nord"]
[null,4330,"Evida Nord"]
[null,4340,"Evida Syd"]
[null,4350,"Evida Syd"]
[null,4360,"Evida Syd"]
[null,4390,"Evida Syd"]
[null,4400,"Evida Syd"]
[null,4420,"Evida Syd"]
[null,4440,"Evida Syd"]
[null,4450,"Evida Syd"]
[null,4500,"Evida Syd"]
[null,4520,"Evida Syd"]
[null,4532,"Evida Syd"]
[null,4534,"Evida Syd"]
[null,4540,"Evida Syd"]
[null,4550,"Evida Syd"]
[null,4560,"Evida Syd"]
[null,4571,"Evida Syd"]
[null,4573,"Evida Syd"]
[null,4600,"Evida Nord"]
[null,4621,"Evida Nord"]
[null,4622,"Evida Nord"]
[null,4623,"Evida Nord"]
[null,4632,"Evida Nord"]
[null,4640,"Evida Syd"]
[null,4652,"Evida Nord"]
[null,4653,"Evida Syd"]
[null,4654,"Evida Syd"]
[null,4660,"Evida Syd"]
[null,4671,"Evida Nord"]
[null,4672,"Evida Syd"]
[null,4673,"Evida Syd"]
[null,4681,"Evida Nord"]
[null,4683,"Evida Syd"]
[null,4684,"Evida Syd"]
[null,4690,"Evida Syd"]
[null,4700,"Evida Syd"]
[null,4720,"Evida Syd"]
[null,4733,"Evida Syd"]
[null,4735,"Evida Syd"]
[null,4736,"Evida Syd"]
[null,4750,"Evida Syd"]
[null,4760,"Evida Syd"]
[null,4773,"Evida Syd"]
[null,5000,"Evida Fyn"]
[null,5210,"Evida Fyn"]
[null,5220,"Evida Fyn"]
[null,5230,"Evida Fyn"]
[null,5240,"Evida Fyn"]
[null,5250,"Evida Fyn"]
[null,5260,"Evida Fyn"]
[null,5270,"Evida Fyn"]
[null,5290,"Evida Fyn"]
[null,5300,"Evida Fyn"]
[null,5330,"Evida Fyn"]
[null,5350,"Evida Fyn"]
[null,5380,"Evida Fyn"]
[null,5400,"Evida Fyn"]
[null,5450,"Evida Fyn"]
[null,5462,"Evida Fyn"]
[null,5463,"Evida Fyn"]
[null,5464,"Evida Fyn"]
[null,5466,"Evida Fyn"]
[null,5471,"Evida Fyn"]
[null,5474,"Evida Fyn"]
[null,5485,"Evida Fyn"]
[null,5491,"Evida Fyn"]
[null,5492,"Evida Fyn"]
[null,5500,"Evida Fyn"]
[null,5540,"Evida Fyn"]
[null,5550,"Evida Fyn"]
[null,5560,"Evida Fyn"]
[null,5580,"Evida Fyn"]
[null,5591,"Evida Fyn"]
[null,5592,"Evida Fyn"]
[null,5600,"Evida Fyn"]
[null,5610,"Evida Fyn"]
[null,5620,"Evida Fyn"]
[null,5631,"Evida Fyn"]
[null,5642,"Evida Fyn"]
[null,5672,"Evida Fyn"]
[null,5683,"Evida Fyn"]
[null,5690,"Evida Fyn"]
[null,5700,"Evida Fyn"]
[null,5750,"Evida Fyn"]
[null,5762,"Evida Fyn"]
[null,5771,"Evida Fyn"]
[null,5772,"Evida Fyn"]
[null,5792,"Evida Fyn"]
[null,5800,"Evida Fyn"]
[null,5853,"Evida Fyn"]
[null,5854,"Evida Fyn"]
[null,5856,"Evida Fyn"]
[null,5863,"Evida Fyn"]
[null,5871,"Evida Fyn"]
[null,5874,"Evida Fyn"]
[null,5881,"Evida Fyn"]
[null,5882,"Evida Fyn"]
[null,5883,"Evida Fyn"]
[null,5884,"Evida Fyn"]
[null,5892,"Evida Fyn"]
[null,6000,"Evida Syd"]
[null,6040,"Evida Syd"]
[null,6051,"Evida Syd"]
[null,6052,"Evida Syd"]
[null,6064,"Evida Syd"]
[null,6070,"Evida Syd"]
[null,6091,"Evida Syd"]
[null,6092,"Evida Syd"]
[null,6093,"Evida Syd"]
[null,6094,"Evida Syd"]
[null,6100,"Evida Syd"]
[null,6200,"Evida Syd"]
[null,6230,"Evida Syd"]
[null,6240,"Evida Syd"]
[null,6261,"Evida Syd"]
[null,6270,"Evida Syd"]
[null,6280,"Evida Syd"]
[null,6300,"Evida Syd"]
[null,6310,"Evida Syd"]
[null,6320,"Evida Syd"]
[null,6330,"Evida Syd"]
[null,6340,"Evida Syd"]
[null,6360,"Evida Syd"]
[null,6372,"Evida Syd"]
[null,6392,"Evida Syd"]
[null,6400,"Evida Syd"]
[null,6430,"Evida Syd"]
[null,6440,"Evida Syd"]
[null,6470,"Evida Syd"]
[null,6500,"Evida Syd"]
[null,6510,"Evida Syd"]
[null,6520,"Evida Syd"]
[null,6534,"Evida Syd"]
[null,6535,"Evida Syd"]
[null,6541,"Evida Syd"]
[null,6560,"Evida Syd"]
[null,6580,"Evida Syd"]
[null,6600,"Evida Syd"]
[null,6621,"Evida Syd"]
[null,6622,"Evida Syd"]
[null,6623,"Evida Syd"]
[null,6630,"Evida Syd"]
[null,6640,"Evida Syd"]
[null,6650,"Evida Syd"]
[null,6660,"Evida Syd"]
[null,6670,"Evida Syd"]
[null,6682,"Evida Syd"]
[null,6683,"Evida Syd"]
[null,6690,"Evida Syd"]
[null,6700,"Evida Syd"]
[null,6705,"Evida Syd"]
[null,6715,"Evida Syd"]
[null,6731,"Evida Syd"]
[null,6740,"Evida Syd"]
[null,6752,"Evida Syd"]
[null,6753,"Evida Syd"]
[null,6760,"Evida Syd"]
[null,6771,"Evida Syd"]
[null,6780,"Evida Syd"]
[null,6800,"Evida Syd"]
[null,6818,"Evida Syd"]
[null,6823,"Evida Syd"]
[null,6830,"Evida Syd"]
[null,6840,"Evida Syd"]
[null,6851,"Evida Syd"]
[null,6852,"Evida Syd"]
[null,6855,"Evida Syd"]
[null,6862,"Evida Syd"]
[null,6870,"Evida Syd"]
[null,6880,"Evida Nord"]
[null,6893,"Evida Nord"]
[null,6900,"Evida Nord"]
[null,6920,"Evida Nord"]
[null,6933,"Evida Nord"]
[null,6940,"Evida Nord"]
[null,6950,"Evida Nord"]
[null,6960,"Evida Nord"]
[null,6971,"Evida Nord"]
[null,6973,"Evida Nord"]
[null,6980,"Evida Nord"]
[null,7000,"Evida Syd"]
[null,7080,"Evida Syd"]
[null,7100,"Evida Syd"]
[null,7120,"Evida Syd"]
[null,7130,"Evida Syd"]
[null,7140,"Evida Syd"]
[null,7150,"Evida Syd"]
[null,7160,"Evida Syd"]
[null,7171,"Evida Syd"]
[null,7173,"Evida Syd"]
[null,7182,"Evida Syd"]
[null,7183,"Evida Syd"]
[null,7184,"Evida Syd"]
[null,7190,"Evida Syd"]
[null,7200,"Evida Syd"]
[null,7250,"Evida Syd"]
[null,7300,"Evida Syd"]
[null,7321,"Evida Syd"]
[null,7323,"Evida Syd"]
[null,7330,"Evida Nord"]
[null,7361,"Evida Syd"]
[null,7400,"Evida Nord"]
[null,7430,"Evida Nord"]
[null,7441,"Evida Nord"]
[null,7442,"Evida Nord"]
[null,7451,"Evida Nord"]
[null,7470,"Evida Nord"]
[null,7480,"Evida Nord"]
[null,7490,"Evida Nord"]
[null,7500,"Evida Nord"]
[null,7540,"Evida Nord"]
[null,7550,"Evida Nord"]
[null,7560,"Evida Nord"]
[null,7600,"Evida Nord"]
[null,7620,"Evida Nord"]
[null,7673,"Evida Nord"]
[null,7680,"Evida Nord"]
[null,7700,"Evida Nord"]
[null,7730,"Evida Nord"]
[null,7752,"Evida Nord"]
[null,7755,"Evida Nord"]
[null,7760,"Evida Nord"]
[null,7800,"Evida Nord"]
[null,7830,"Evida Nord"]
[null,7840,"Evida Nord"]
[null,7850,"Evida Nord"]
[null,7860,"Evida Nord"]
[null,7870,"Evida Nord"]
[null,7884,"Evida Nord"]
[null,7900,"Evida Nord"]
[null,7950,"Evida Nord"]
[null,7960,"Evida Nord"]
[null,7970,"Evida Nord"]
[null,7980,"Evida Nord"]
[null,7990,"Evida Nord"]
[null,8200,"Evida Nord"]
[null,8220,"Evida Nord"]
[null,8300,"Evida Nord"]
[null,8350,"Evida Nord"]
[null,8370,"Evida Nord"]
[null,8380,"Evida Nord"]
[null,8381,"Evida Nord"]
[null,8382,"Evida Nord"]
[null,8450,"Evida Nord"]
[null,8464,"Evida Nord"]
[null,8471,"Evida Nord"]
[null,8472,"Evida Nord"]
[null,8543,"Evida Nord"]
[null,8600,"Evida Nord"]
[null,8620,"Evida Nord"]
[null,8632,"Evida Nord"]
[null,8641,"Evida Nord"]
[null,8643,"Evida Nord"]
[null,8653,"Evida Nord"]
[null,8654,"Evida Nord"]
[null,8660,"Evida Syd"]
[null,8670,"Evida Nord"]
[null,8680,"Evida Nord"]
[null,8700,"Evida Syd"]
[null,8721,"Evida Syd"]
[null,8722,"Evida Syd"]
[null,8723,"Evida Syd"]
[null,8732,"Evida Syd"]
[null,8740,"Evida Syd"]
[null,8751,"Evida Syd"]
[null,8752,"Evida Syd"]
[null,8762,"Evida Syd"]
[null,8763,"Evida Syd"]
[null,8765,"Evida Syd"]
[null,8766,"Evida Syd"]
[null,8781,"Evida Syd"]
[null,8783,"Evida Syd"]
[null,8800,"Evida Nord"]
[null,8830,"Evida Nord"]
[null,8831,"Evida Nord"]
[null,8832,"Evida Nord"]
[null,8840,"Evida Nord"]
[null,8850,"Evida Nord"]
[null,8860,"Evida Nord"]
[null,8870,"Evida Nord"]
[null,8881,"Evida Nord"]
[null,8900,"Evida Nord"]
[null,8920,"Evida Nord"]
{"$rows_left_out":64}